Slideshow Example not working

Slideshow Example not working

Hello experts, I have Win7 and Visual Studio 2008 and while trying to run the Slideshow Example I get the below error; Could you please check and advice? Thanks in advance! 1>------ Build started: Project: SlideshowExampleApplication, Configuration: Debug Win32 ------ 1>Compiling... 1>stdafx.cpp 1>Automatically linking with adpcppfd.lib 1>Automatically linking with adpcored.lib 1>Automatically linking with Psapi.lib 1>c:\users\rsabori1\documents\atom\slideshowexample\picasaexamplecomponent\picasacomponentinterface.h(25) : error C2504: 'ComponentID' : base class undefined 1>c:\users\rsabori1\documents\atom\slideshowexample\picasaexamplecomponent\picasacomponentinterface.h(29) : error C2146: syntax error : missing ';' before identifier 'id' 1>c:\users\rsabori1\documents\atom\slideshowexample\picasaexamplecomponent\picasacomponentinterface.h(29) : error C4430: missing type specifier - int assumed. Note: C++ does not support default-int 1>c:\users\rsabori1\documents\atom\slideshowexample\picasaexamplecomponent\picasacomponentinterface.h(29) : error C4430: missing type specifier - int assumed. Note: C++ does not support default-int 1>c:\users\rsabori1\documents\atom\slideshowexample\picasaexamplecomponent\picasacomponentinterface.h(29) : error C4430: missing type specifier - int assumed. Note: C++ does not support default-int 1>c:\users\rsabori1\documents\atom\slideshowexample\slideshowexampleapplication\stdafx.h(43) : fatal error C1083: Cannot open include file: 'UnauthorizedException.h': No such file or directory 1>Creating browse information file... 1>Microsoft Browse Information Maintenance Utility Version 9.00.21022 1>Copyright (C) Microsoft Corporation. All rights reserved. 1>BSCMAKE: error BK1506 : cannot open file '.\Debug\ChildView.sbr': No such file or directory 1>Project : warning PRJ0018 : The following environment variables were not found: 1>$(IADP_SDK_HOME) 1>Build log was saved at "file://c:\Users\rsabori1\Documents\ATOM\SlideshowExample\SlideshowExampleApplication\Debug\BuildLog.htm" 1>SlideshowExampleApplication - 7 error(s), 0 warning(s) ========== Build: 0 succeeded, 1 failed, 0 up-to-date, 0 skipped ==========
2 Beiträge / 0 neu
Letzter Beitrag
Nähere Informationen zur Compiler-Optimierung finden Sie in unserem Optimierungshinweis.

Roy,

It looks as though your sample project cannot find the Intel ATOM SDK includes:

"Cannot open include file: 'UnauthorizedException.h': No such file or directory"

Please ensure that you have installed the ATOM SDK and that your include and library references point to the correct folder.

Kommentar hinterlassen

Bitte anmelden, um einen Kommentar hinzuzufügen. Sie sind noch nicht Mitglied? Jetzt teilnehmen