Build issue with intel multi os engine

Build issue with intel multi os engine

Hi Any one can help me?

I got this, issue when I build from osx:

Build started (1.0.702)
Incremental java compilation is an incubating feature.
:common:compileJava UP-TO-DATE
:common:processResources UP-TO-DATE
:common:classes UP-TO-DATE
:common:jar UP-TO-DATE
:ios_sample1:compileJava UP-TO-DATE
:ios_sample1:processResources UP-TO-DATE
:ios_sample1:classes UP-TO-DATE
:ios_sample1:moeMainProGuard UP-TO-DATE
:ios_sample1:moeMainRetrolambda UP-TO-DATE
:ios_sample1:moeMainDebugDex UP-TO-DATE

###########
# ERROR LOG
###########

dex2oat I 13589 1142240 /teamcity/workdir/moe_repo_build/moe_repo/art/dex2oat/dex2oat.cc:2220] /Applications/Intel/multi_os_engine/tools/dex2oat --instruction-set=x86 --base=0x40000000 --compiler-backend=Quick --generate-debug-info --image=/Users/platform/rssreader/ios_sample1/build/moe/main/Debug/x86/image.art --image-classes=/Applications/Intel/multi_os_engine/tools/preloaded-classes --oat-file=/Users/platform/rssreader/ios_sample1/build/moe/main/Debug/x86/application.oat --dex-file=/Users/platform/rssreader/ios_sample1/build/moe/main/Debug/classes.jar:/Applications/Intel/multi_os_engine/sdk/intel-moe-core.dex:/Applications/Intel/multi_os_engine/sdk/intel-moe-ios-retro.jar
dex2oat I 13589 1142240 /teamcity/workdir/moe_repo_build/moe_repo/art/runtime/parsed_options.cc:449] setting boot class path to /Users/platform/rssreader/ios_sample1/build/moe/main/Debug/classes.jar:/Applications/Intel/multi_os_engine/sdk/intel-moe-core.dex:/Applications/Intel/multi_os_engine/sdk/intel-moe-ios-retro.jar
dex2oat W 13589 1142263 /teamcity/workdir/moe_repo_build/moe_repo/art/compiler/driver/compiler_driver.cc:1860] Skipping class org.json.JSONArray from /Applications/Intel/multi_os_engine/sdk/intel-moe-core.dex previously found in /Users/platform/rssreader/ios_sample1/build/moe/main/Debug/classes.jar
dex2oat W 13589 1142260 /teamcity/workdir/moe_repo_build/moe_repo/art/compiler/driver/compiler_driver.cc:1860] Skipping class org.json.JSONException from /Applications/Intel/multi_os_engine/sdk/intel-moe-core.dex previously found in /Users/platform/rssreader/ios_sample1/build/moe/main/Debug/classes.jar
dex2oat W 13589 1142258 /teamcity/workdir/moe_repo_build/moe_repo/art/compiler/driver/compiler_driver.cc:1860] Skipping class org.json.JSONObject$1 from /Applications/Intel/multi_os_engine/sdk/intel-moe-core.dex previously found in /Users/platform/rssreader/ios_sample1/build/moe/main/Debug/classes.jar
dex2oat W 13589 1142240 /teamcity/workdir/moe_repo_build/moe_repo/art/compiler/driver/compiler_driver.cc:1860] Skipping class org.json.JSONObject from /Applications/Intel/multi_os_engine/sdk/intel-moe-core.dex previously found in /Users/platform/rssreader/ios_sample1/build/moe/main/Debug/classes.jar
dex2oat W 13589 1142259 /teamcity/workdir/moe_repo_build/moe_repo/art/compiler/driver/compiler_driver.cc:1860] Skipping class org.json.JSONTokener from /Applications/Intel/multi_os_engine/sdk/intel-moe-core.dex previously found in /Users/platform/rssreader/ios_sample1/build/moe/main/Debug/classes.jar
dex2oat W 13589 1142262 /teamcity/workdir/moe_repo_build/moe_repo/art/compiler/driver/compiler_driver.cc:1860] Skipping class org.json.JSONArray from /Applications/Intel/multi_os_engine/sdk/intel-moe-core.dex previously found in /Users/platform/rssreader/ios_sample1/build/moe/main/Debug/classes.jar
dex2oat W 13589 1142262 /teamcity/workdir/moe_repo_build/moe_repo/art/compiler/driver/compiler_driver.cc:1860] Skipping class org.json.JSONException from /Applications/Intel/multi_os_engine/sdk/intel-moe-core.dex previously found in /Users/platform/rssreader/ios_sample1/build/moe/main/Debug/classes.jar
dex2oat W 13589 1142262 /teamcity/workdir/moe_repo_build/moe_repo/art/compiler/driver/compiler_driver.cc:1860] Skipping class org.json.JSONObject$1 from /Applications/Intel/multi_os_engine/sdk/intel-moe-core.dex previously found in /Users/platform/rssreader/ios_sample1/build/moe/main/Debug/classes.jar
dex2oat W 13589 1142262 /teamcity/workdir/moe_repo_build/moe_repo/art/compiler/driver/compiler_driver.cc:1860] Skipping class org.json.JSONObject from /Applications/Intel/multi_os_engine/sdk/intel-moe-core.dex previously found in /Users/platform/rssreader/ios_sample1/build/moe/main/Debug/classes.jar
dex2oat W 13589 1142262 /teamcity/workdir/moe_repo_build/moe_repo/art/compiler/driver/compiler_driver.cc:1860] Skipping class org.json.JSONTokener from /Applications/Intel/multi_os_engine/sdk/intel-moe-core.dex previously found in /Users/platform/rssreader/ios_sample1/build/moe/main/Debug/classes.jar
dex2oat W 13589 1142262 /teamcity/workdir/moe_repo_build/moe_repo/art/compiler/dex/verification_results.cc:61] Method processed more than once: void android.icu.text.NumberFormat.<clinit>()
dex2oat W 13589 1142262 /teamcity/workdir/moe_repo_build/moe_repo/art/compiler/dex/verification_results.cc:61] Method processed more than once: java.lang.String java.lang.AbstractStringBuilder.substring(int)
dex2oat W 13589 1142262 /teamcity/workdir/moe_repo_build/moe_repo/art/compiler/dex/verification_results.cc:61] Method processed more than once: java.lang.String com.android.org.bouncycastle.util.Strings.toLowerCase(java.lang.String)
dex2oat W 13589 1142262 /teamcity/workdir/moe_repo_build/moe_repo/art/compiler/dex/verification_results.cc:61] Method processed more than once: java.lang.String java.lang.IntegralToString.stringOf(char[])
dex2oat W 13589 1142262 /teamcity/workdir/moe_repo_build/moe_repo/art/compiler/driver/compiler_driver.cc:1860] Skipping class org.json.JSONArray from /Applications/Intel/multi_os_engine/sdk/intel-moe-core.dex previously found in /Users/platform/rssreader/ios_sample1/build/moe/main/Debug/classes.jar
dex2oat W 13589 1142262 /teamcity/workdir/moe_repo_build/moe_repo/art/compiler/driver/compiler_driver.cc:1860] Skipping class org.json.JSONException from /Applications/Intel/multi_os_engine/sdk/intel-moe-core.dex previously found in /Users/platform/rssreader/ios_sample1/build/moe/main/Debug/classes.jar
dex2oat W 13589 1142262 /teamcity/workdir/moe_repo_build/moe_repo/art/compiler/driver/compiler_driver.cc:1860] Skipping class org.json.JSONObject$1 from /Applications/Intel/multi_os_engine/sdk/intel-moe-core.dex previously found in /Users/platform/rssreader/ios_sample1/build/moe/main/Debug/classes.jar
dex2oat W 13589 1142262 /teamcity/workdir/moe_repo_build/moe_repo/art/compiler/driver/compiler_driver.cc:1860] Skipping class org.json.JSONObject from /Applications/Intel/multi_os_engine/sdk/intel-moe-core.dex previously found in /Users/platform/rssreader/ios_sample1/build/moe/main/Debug/classes.jar
dex2oat W 13589 1142262 /teamcity/workdir/moe_repo_build/moe_repo/art/compiler/driver/compiler_driver.cc:1860] Skipping class org.json.JSONTokener from /Applications/Intel/multi_os_engine/sdk/intel-moe-core.dex previously found in /Users/platform/rssreader/ios_sample1/build/moe/main/Debug/classes.jar
dex2oat I 13589 1142240 /teamcity/workdir/moe_repo_build/moe_repo/art/runtime/gc/heap.cc:2713] Explicit concurrent mark sweep GC freed 21843(5MB) AllocSpace objects, 0(0B) LOS objects, 37% free, 6MB/10MB, paused 17us total 9.526ms
dex2oat W 13589 1142261 /teamcity/workdir/moe_repo_build/moe_repo/art/compiler/driver/compiler_driver.cc:1860] Skipping class org.json.JSONArray from /Applications/Intel/multi_os_engine/sdk/intel-moe-core.dex previously found in /Users/platform/rssreader/ios_sample1/build/moe/main/Debug/classes.jar
dex2oat W 13589 1142261 /teamcity/workdir/moe_repo_build/moe_repo/art/compiler/driver/compiler_driver.cc:1860] Skipping class org.json.JSONException from /Applications/Intel/multi_os_engine/sdk/intel-moe-core.dex previously found in /Users/platform/rssreader/ios_sample1/build/moe/main/Debug/classes.jar
dex2oat W 13589 1142261 /teamcity/workdir/moe_repo_build/moe_repo/art/compiler/driver/compiler_driver.cc:1860] Skipping class org.json.JSONObject$1 from /Applications/Intel/multi_os_engine/sdk/intel-moe-core.dex previously found in /Users/platform/rssreader/ios_sample1/build/moe/main/Debug/classes.jar
dex2oat W 13589 1142261 /teamcity/workdir/moe_repo_build/moe_repo/art/compiler/driver/compiler_driver.cc:1860] Skipping class org.json.JSONObject from /Applications/Intel/multi_os_engine/sdk/intel-moe-core.dex previously found in /Users/platform/rssreader/ios_sample1/build/moe/main/Debug/classes.jar
dex2oat W 13589 1142264 /teamcity/workdir/moe_repo_build/moe_repo/art/compiler/driver/compiler_driver.cc:1860] Skipping class org.json.JSONTokener from /Applications/Intel/multi_os_engine/sdk/intel-moe-core.dex previously found in /Users/platform/rssreader/ios_sample1/build/moe/main/Debug/classes.jar
dex2oat F 13589 1142240 /teamcity/workdir/moe_repo_build/moe_repo/art/compiler/oat_writer.cc:645]Unexpected failure to resolve a method: void org.json.JSONArray.<init>(java.lang.String)dex2oat F 13589 1142240 /teamcity/workdir/moe_repo_build/moe_repo/art/compiler/oat_writer.cc:650] java.lang.NoSuchMethodError: No direct method <init>(Ljava/lang/String;)V in class Lorg/json/JSONArray; or its super classes (declaration of 'org.json.JSONArray' appears in /Users/platform/rssreader/ios_sample1/build/moe/main/Debug/classes.jar)
dex2oat F 13589 1142240 /teamcity/workdir/moe_repo_build/moe_repo/art/compiler/oat_writer.cc:650] (Throwable with empty stack trace)
dex2oat F 13589 1142240 /teamcity/workdir/moe_repo_build/moe_repo/art/runtime/runtime.cc:448]Runtime aborting...
Aborting thread:
"main" prio=5 tid=1 Runnable (still starting up)
  | group="" sCount=0 dsCount=0 obj=0x0 self=0x7facd3802000
  | sysTid=1142240 nice=-1 cgrp=default sched=1/31 handle=0x7fff7896c000
  | state=? schedstat=( 0 0 0 ) utm=0 stm=0 core=0 HZ=100
  | stack=0x7fff5d37e000-0x7fff5d386000 stackSize=8MB
  | held mutexes= "abort lock" "mutator lock"(shared held)
  (no managed stack frames)
Pending exception java.lang.NoSuchMethodError: No direct method <init>(Ljava/lang/String;)V in class Lorg/json/JSONArray; or its super classes (declaration of 'org.json.JSONArray' appears in /Users/platform/rssreader/ios_sample1/build/moe/main/Debug/classes.jar)
(Throwable with empty stack trace)Dumping all threads without appropriate locks held: thread list lock
All threads:
DALVIK THREADS (1):
"main" prio=5 tid=1 Runnable (still starting up)
  | group="" sCount=0 dsCount=0 obj=0x0 self=0x7facd3802000
  | sysTid=1142240 nice=-1 cgrp=default sched=1/31 handle=0x7fff7896c000
  | state=? schedstat=( 0 0 0 ) utm=0 stm=0 core=0 HZ=100
  | stack=0x7fff5d37e000-0x7fff5d386000 stackSize=8MB
  | held mutexes= "abort lock" "mutator lock"(shared held)
  (no managed stack frames)

dex2oat W 13589 1142240 /teamcity/workdir/moe_repo_build/moe_repo/art/runtime/barrier.cc:96] Attempted to destroy barrier with non zero count -1
:ios_sample1:moeMainDebugX86Dex2Oat FAILED

FAILURE: Build failed with an exception.

* What went wrong:
Execution failed for task ':ios_sample1:moeMainDebugX86Dex2Oat'.
> Process 'command '/Applications/Intel/multi_os_engine/tools/dex2oat'' finished with non-zero exit value 134

* Try:
Run with --stacktrace option to get the stack trace. Run with --info or --debug option to get more log output.

BUILD FAILED

Total time: 8.154 secs
BUILD FINISHED WITH ERROR: see above

1 post / 0 new
For more complete information about compiler optimizations, see our Optimization Notice.