Internal compiler error report

Internal compiler error report

graziano.giulianigmail.com's picture

Hi,

caught this on Linux on make check for netcdf 4.1.1 with 12.0.0 20101006

making check in nf_test
make[1]: Entering directory `/opt/intel/Software/src/netcdf-4.1.1/nf_test'
make nf_test tst_f77_v2 ftst_vars ftst_vars2 ftst_vars3 ftst_vars4 ftst_vars5 ftst_vars6 ftst_types ftst_types2 ftst_types3 ftst_groups f90tst_vars tst_types tst_types2 f90tst_vars_vlen tst_f90_nc4 f90tst_grps f90tst_fill f90tst_fill2 f90tst_vars3 ftst_v2 ftest tst_f90
make[2]: Entering directory `/opt/intel/Software/src/netcdf-4.1.1/nf_test'
/bin/sh ../libtool --tag=F77 --mode=link ifort -I../fortran -I/opt/intel/Software/include -I../libsrc4 -I../f90 -O3 -axSSE4.2 -fPIC -mtune=core2 -L/opt/intel/Software/lib -lcurl -Wl,--hash-style=gnu -Wl,--as-needed -o nf_test test_get.o test_put.o nf_error.o nf_test.o test_read.o test_write.o util.o fortlib.o ../libsrc4/libnetcdf.la ../libsrc4/libnetcdf.la -lmfhdf -ldf -ljpeg -lhdf5_hl -lhdf5 -lz
libtool: link: ifort -I../fortran -I/opt/intel/Software/include -I../libsrc4 -I../f90 -O3 -axSSE4.2 -fPIC -mtune=core2 -Wl,--hash-style=gnu -Wl,--as-needed -o nf_test test_get.o test_put.o nf_error.o nf_test.o test_read.o test_write.o util.o fortlib.o -L/opt/intel/Software/lib -L/lib ../libsrc4/.libs/libnetcdf.a -lcurl /opt/intel/Software/lib/libmfhdf.a /opt/intel/Software/lib/libdf.a -ljpeg /opt/intel/Software/lib/libhdf5_hl.so /opt/intel/Software/lib/libhdf5.so /opt/intel/Software/lib/libsz.so -lm -lz -Wl,-rpath -Wl,/opt/intel/Software/lib -Wl,-rpath -Wl,/opt/intel/Software/lib
backend signals

fortcom: Severe: **Internal compiler error: internal abort** Please report this error along with the circumstances in which it occurred in a Software Problem Report. Note: File and line given may not be explicit cause of this error.

ifort: error #10014: problem during multi-file optimization compilation (code 3)
make[2]: *** [nf_test] Error 3
make[2]: Leaving directory `/opt/intel/Software/src/netcdf-4.1.1/nf_test'
make[1]: *** [check-am] Error 2
make[1]: Leaving directory `/opt/intel/Software/src/netcdf-4.1.1/nf_test'
make: *** [check-recursive] Error 1

netcdf are compiling against szip and hdf5 compiled with no errors (make check succeded) using same compiler.

Linux portatile 2.6.35-ARCH #1 SMP PREEMPT Sat Oct 30 21:22:26 CEST 2010 x86_64 Intel Core i7 CPU Q 740 @ 1.73GHz GenuineIntel GNU/Linux

1 post / 0 new
For more complete information about compiler optimizations, see our Optimization Notice.