Search

Search Results for:

Search Results: 1,300

  1. error #6285: There is no matching specific subroutine for this ...

    https://software.intel.com/en-us/forums/intel-fortran-compiler-for-linux-and-mac-os-x/topic/271155

    Jan 5, 2012 ... pr2.f90(21): error #6285: There is no matching specific subroutine for this generic subroutine call. [DFPMIN] call dfpmin(v,func,dfunc) -----^

  2. MPI_SIZEOF No matching specific subroutine for this generic ...

    https://software.intel.com/en-us/forums/intel-clusters-and-hpc-technology/topic/609814

    Feb 10, 2016 ... I get the error: error #6285: There is no matching specific subroutine for this generic subroutine call. [MPI_SIZEOF]. on the line. view sourceprint ...

  3. Can't pass derived types thru a subroutine call?

    https://software.intel.com/es-es/forums/intel-visual-fortran-compiler-for-windows/topic/285591

    This simple example does not work.I get an error #6633 for all three arguments. Says the types don't match. Am I doing something wrong? This seems pretty ...

  4. subroutine call using array subobject syntax

    https://software.intel.com/en-us/forums/intel-fortran-compiler-for-linux-and-mac-os-x/topic/600614

    Nov 19, 2015 ... If I compile this code with ifort 15.0.0 20140723 , the program prints only "a". Now, I think I have found somewhere in Metcalfs book that it is ...

  5. OpenMP parallelization of a Subroutine call

    https://software.intel.com/de-de/forums/intel-visual-fortran-compiler-for-windows/topic/477919

    Hello, and congratulations for your community. My problem is as follows... I have a model that calculates several parameters in a parent grid and in several (5 ...

  6. There is no matching specific subroutine for this type bound generic ...

    https://software.intel.com/en-us/forums/intel-visual-fortran-compiler-for-windows/topic/537784

    Dec 30, 2014 ... 11, 2014-12-31 TObject.f90(28): error #8486: There is no matching specific subroutine for this type bound generic subroutine call. [GETVALUE] ...

  7. Passing a complex to real array in a subroutine call in Intel Visual ...

    https://software.intel.com/es-es/forums/intel-visual-fortran-compiler-for-windows/topic/289586

    Hi! I get an error (6633) trying to pass a complex array into a subroutine that has a real value as the dummy argument. A short snippet of code is as follows, ...

  8. overhead when using subroutine - how to use inline

    https://software.intel.com/en-us/forums/intel-visual-fortran-compiler-for-windows/topic/329286

    Oct 19, 2012 ... ... the compiler would automatically inline the functions having the meaning that there was no overhead in using a subroutine call or function.

  9. Subroutine Call and LAPACK Utility Function

    https://software.intel.com/fr-fr/forums/intel-math-kernel-library/topic/375973

    Hi, I'm trying to run a very simple code that finds machine epsilon with DLAMCH from LAPACK utility function and calls some random subroutine afterward.

  10. Parameterized derived type and generic subroutine call

    https://software.intel.com/en-us/forums/intel-fortran-compiler-for-linux-and-mac-os-x/topic/531938

    Sep 25, 2014 ... The attached file does not compile with ifort version 15.0.0 on openSuSE 13.1. The second argument to the generic type bound procedure ...

  11. Pardiso - There is no matching specific subroutine

    https://software.intel.com/en-us/forums/intel-math-kernel-library/topic/363151

    Jan 28, 2013 ... The error is: Error 1 error #6285: There is no matching specific subroutine for this generic subroutine call. [PARDISO_64] Here it is my code.

  12. Loop optimization in the presence of a subroutine call

    https://software.intel.com/en-us/forums/intel-fortran-compiler-for-linux-and-mac-os-x/topic/270940

    Sep 9, 2011 ... I'm trying some code a bit like this: module mminterface subroutine anything end subroutineend interface contains subroutine multiplygrid(a, b, ...

  13. Compiler error involving unlimited polymorphic type, optional ...

    https://software.intel.com/en-us/forums/intel-fortran-compiler-for-linux-and-mac-os-x/topic/271334

    May 9, 2012 ... Compiler error involving unlimited polymorphic type, optional argument, subroutine call and function call. Compiler error involving unlimited ...

  14. Error passing text-string in a subroutine call

    https://software.intel.com/en-us/forums/intel-visual-fortran-compiler-for-windows/topic/455942

    Aug 27, 2013 ... Hi,. When compiling the code below I get the message: Error 1 Error: If the actual argument is scalar, the corresponding dummy argument shall ...

  15. Compaq fortran -Subroutine Call Map

    https://software.intel.com/en-us/forums/intel-visual-fortran-compiler-for-windows/topic/271664

    Sep 11, 2003 ... I am using Compaq fortran compiler and have not done much programing in fortran on the PC. Does anyone know of any utility that will map out ...

  16. error #6285: There is no matching specific subroutine for this ...

    https://software.intel.com/en-us/forums/intel-math-kernel-library/topic/287149

    Oct 19, 2010 ... The following error appears:error #6285: There is no matching specific subroutine for this generic subroutine call.I show my code below.

  17. Error: There is no matching specific subroutine for this generic ...

    https://software.intel.com/en-us/forums/intel-visual-fortran-compiler-for-windows/topic/293683

    Oct 21, 2009 ... ... me fix a fortran program compiler error concernin "Error: There is no matching specific subroutine for this generic subroutine call" My program ...

  18. Call MKL Lapack subroutines and run on HPC machine

    https://software.intel.com/en-us/forums/intel-math-kernel-library/topic/328614

    Oct 4, 2012 ... matrix_inverse.f90(12): error #6285: There is no matching specific subroutine for this generic subroutine call. [SYTRF] CALL sytrf(MATA, 'U', ...

  19. Misleading error report: Excess arguments in a subroutine call

    https://software.intel.com/en-us/forums/intel-visual-fortran-compiler-for-windows/topic/297124

    Apr 21, 2009 ... This is ridiculous. Anew subroutine I'm developing had five dummy arguments during the initial test phase. The final design requiresseven ...

  20. problem passing arrays from one subroutine to another

    https://software.intel.com/en-us/forums/intel-visual-fortran-compiler-for-windows/topic/287749

    Sep 13, 2010 ... A subroutine call can be entirely correct as to syntax, yet be totally wrong .... It is when the subroutine call or function reference is incompatible ...

For more complete information about compiler optimizations, see our Optimization Notice.