build-driver Errors While Making sepdk Components For Fedora 3.6.2-4.fc17.x86_64

build-driver Errors While Making sepdk Components For Fedora 3.6.2-4.fc17.x86_64

When running build-driver  to make sepdk components for Fedora 3.6.2-4.fc17.x86_64, I get the following errors:

make[2]: Entering directory `/usr/src/kernels/3.6.2-4.fc17.x86_64'
  CC [M]  /opt/intel/vtune_amplifier_xe_2013/sepdk/src/vtsspp/collector.o
  CC [M]  /opt/intel/vtune_amplifier_xe_2013/sepdk/src/vtsspp/procfs.o
  CC [M]  /opt/intel/vtune_amplifier_xe_2013/sepdk/src/vtsspp/transport.o
  CC [M]  /opt/intel/vtune_amplifier_xe_2013/sepdk/src/vtsspp/uec.o
  CC [M]  /opt/intel/vtune_amplifier_xe_2013/sepdk/src/vtsspp/record.o
  CC [M]  /opt/intel/vtune_amplifier_xe_2013/sepdk/src/vtsspp/module.o
  CC [M]  /opt/intel/vtune_amplifier_xe_2013/sepdk/src/vtsspp/task_map.o
  CC [M]  /opt/intel/vtune_amplifier_xe_2013/sepdk/src/vtsspp/globals.o
  CC [M]  /opt/intel/vtune_amplifier_xe_2013/sepdk/src/vtsspp/user_vm.o
/opt/intel/vtune_amplifier_xe_2013/sepdk/src/vtsspp/user_vm.c: In function ‘vtss_user_vm_page_pin’:
/opt/intel/vtune_amplifier_xe_2013/sepdk/src/vtsspp/user_vm.c:206:62: error: ‘KM_IRQ0’ undeclared (first use in this function)
/opt/intel/vtune_amplifier_xe_2013/sepdk/src/vtsspp/user_vm.c:206:62: note: each undeclared identifier is reported only once for each function it appears in
/opt/intel/vtune_amplifier_xe_2013/sepdk/src/vtsspp/user_vm.c:206:9: error: too many arguments to function ‘kmap_atomic’
In file included from /opt/intel/vtune_amplifier_xe_2013/sepdk/src/vtsspp/user_vm.c:33:0:
include/linux/highmem.h:66:21: note: declared here
/opt/intel/vtune_amplifier_xe_2013/sepdk/src/vtsspp/user_vm.c: In function ‘vtss_user_vm_page_unpin’:
/opt/intel/vtune_amplifier_xe_2013/sepdk/src/vtsspp/user_vm.c:225:69: error: macro "kunmap_atomic" passed 2 arguments, but takes just 1
/opt/intel/vtune_amplifier_xe_2013/sepdk/src/vtsspp/user_vm.c:225:13: error: ‘kunmap_atomic’ undeclared (first use in this function)
make[3]: *** [/opt/intel/vtune_amplifier_xe_2013/sepdk/src/vtsspp/user_vm.o] Error 1
make[2]: *** [_module_/opt/intel/vtune_amplifier_xe_2013/sepdk/src/vtsspp] Error 2
make[2]: Leaving directory `/usr/src/kernels/3.6.2-4.fc17.x86_64'
make[1]: [all] Error 2 (ignored)

publicaciones de 18 / 0 nuevos
Último envío
Para obtener más información sobre las optimizaciones del compilador, consulte el aviso sobre la optimización.
Imagen de Peter Wang (Intel)

Fedora* 17 is supported for VTune(TM) Amplifier XE 2013 U2.
However Fedora 17 kernel version is 3.3, and your kernel version is 3.6 - I suppose that this kernel version hasn't been tested (supported) yet.

Funny comment. Release notes say that Fedora 16 and 17 are supported without stating any restrictions on the kernel version. In addition, the software verifies that the hardware and software are usable by VTune before installing VTune.

I now must decide what to do. My alternatives are 1) download Fedora sources for 3.6 and compile the drivers, 2) find Fedora 17 version 3.3 and download that, or 3) abandon VTune. There is nothing else like VTune; so, option 3 is a non-starter. I'm left with options 1 and 2. Both are time sinks and unproductive activities; consequently, both options are unpalatable. For a productivity and performance tool, VTune installation leaves something to be desired. Intel's VTune developers should read Donald A. Norman's The Design of Everyday Things.

Imagen de Peter Wang (Intel)

Option 2 is workable, I think.

I wiped the disk and installed Fedora 17 3.3.4-5.fc17.x86_64. I disabled nmi_watchdog by writing a zero to the pseudo device. I profiled a profiled a pid (Firefox). VTune reports that the "Analysis is completed successfully"; nevertheless, VTune "Failed to finalize the result. The result you are opening is empty. This may be causd by an error during data collection. Try to re-run the analysis." I attempt to Re-resolve. An addidtional warning appears on the screen: "Cannot finalize the result without raw data. The result you are opening does not contain raw collector data and cannot be finalized. You might have collected the result with 'Remove raw collector data after resolve the result' option set in your preferences. Resolution will be skipped now and existing data will be shown." I did not edit File > Options > General to change the default setting and this setting is NOT selected.

I've looked at the conents of the projects directory at the test that I ran. The data directory is empty. The archive, config, and sqlite-db directories have context.

I discovered an assertion error but cannot tell whether it is the root cause of the problem or associated with the original problem. After being presented with the error, "Cannot finalize the result without raw data," I clicked "OK" rather than click "Cancel" and a window popped up, "Intel VTune Amplifier caused an assertion failure." The first four lines read:
[Assertion]
Expression: m_productQueryLibrary
File: vcs/dicerengine/src/core/results_impl.cpp
Line: 694
I do not know if this is a red herring. This report was sent to Intel.

Needless to say, VTune is not working....

I would like it to work so that I can recommend purchasing the product.

amplxe-gui covered the window in which I started the process. An error message appears after the gui is invoked:

Gtk-Message: Failed to load module "pk-gtk-module"

Please take note that I am running as root so if this is a loadable kernel module, it should have loaded.

[rlane6@perflinux prebuilt]$ ./insmod-sep3
NOTE: super-user or "root" privileges are required in order to continue.
Please enter "root" Password:
Checking for PMU arbitration service (PAX) ... detected.
PAX service is accessible to users in group "vtune".
Executing: insmod ./sep3_8-x32_64-3.3.4-5.fc17.x86_64smp.ko
Creating /dev/sep3_8 base devices with major number 247 ... done.
Creating /dev/sep3_8 percpu devices with major number 246 ... done.
Setting group ownership of devices to group "vtune" ... done.
Setting file permissions on devices to "660" ... done.
The sep3_8 driver has been successfully loaded.
Checking for vtsspp driver ... not detected.
Executing: insmod ./vtsspp/vtsspp-x32_64-3.3.4-5.fc17.x86_64smp.ko gid=1001
The vtsspp driver has been successfully loaded.
[rlane6@perflinux src]$ amplxe-gui
Gtk-Message: Failed to load module "pk-gtk-module" ### at start
Collection has stopped.
Gtk-Message: Failed to load module "pk-gtk-module"
Gtk-Message: Failed to load module "pk-gtk-module"
Aborted (core dumped) ### assert failure send to Intel

Please escalate this problem to development for resolution.

Imagen de Peter Wang (Intel)

Check these steps after installing the product:

1. Are you sure that you use latest Update 2?
Intel(R) VTune(TM) Amplifier XE 2013 (build 253325)
2. # lsmod | grep sep3
sep3_8 63630 0
# lsmod | grep pax
pax 4024 0

3. # amplxe-cl -collect lightweight-hotspots -duration 60 -r /tmp -- firefox
It seemed OK to successfully collected performance data on my side.

4. # amplxe-cl -report hotspots -filter module=firefox

At step 3, ensure that you have enough disk space to store raw data, my case "/tmp". It's OK to send report to Intel if you still have this problem, maybe other root-cause.

### clearly installed update2
[rlane6@perflinux ~]$ ls -l
total 291448
-rw-rw-r--. 1 rlane6 rlane6 0 Oct 29 11:27 default.log
drwxr-xr-x. 2 rlane6 rlane6 4096 Oct 29 09:58 Desktop
drwxr-xr-x. 2 rlane6 rlane6 4096 Oct 29 09:58 Documents
drwxr-xr-x. 2 rlane6 rlane6 4096 Oct 29 09:58 Downloads
drwxr-xr-x. 4 rlane6 rlane6 4096 Oct 29 10:28 intel
-rw-rw-r--. 1 rlane6 rlane6 66581117 Oct 29 19:49 kernel-3.3.4-5.fc17.src.rpm
drwxr-xr-x. 2 rlane6 rlane6 4096 Oct 29 09:58 Music
drwxr-xr-x. 2 rlane6 rlane6 4096 Oct 29 09:58 Pictures
drwxr-xr-x. 2 rlane6 rlane6 4096 Oct 29 09:58 Public
drwxr-xr-x. 4 rlane6 rlane6 4096 Oct 29 19:51 rpmbuild
drwxr-xr-x. 2 rlane6 rlane6 4096 Oct 29 09:58 Templates
drwxr-xr-x. 2 rlane6 rlane6 4096 Oct 29 09:58 Videos
drwxr-xr-x. 5 rlane6 rlane6 4096 Oct 10 13:09 vtune_amplifier_xe_2013_update2
-rw-rw-r--. 1 rlane6 rlane6 231813120 Oct 29 10:10 vtune_amplifier_xe_2013_update2.tar
### numbers differ but loaded
[rlane6@perflinux ~]$ sudo lsmod | grep sep
sep3_8 72336 0
### numbers differ but loaded
[rlane6@perflinux ~]$ sudo lsmod | grep pax
pax 12992 0
### did you actually run this???
[root@perflinux rlane6]# amplxe-cl -collect lightweight-hotspots -duration 60 -r/tmp -- firefox
Unknown option: -r/tmp
### added space
[root@perflinux rlane6]# amplxe-cl -collect lightweight-hotspots -duration 60 -r /tmp -- firefox
Warning: On some systems based on the Intel microarchitecture code name Nehalem / Westmere with C-states enabled, this analysis type may cause system hanging due to a known hardware issue (see errata AAJ134 in http://download.intel.com/design/processor/specupdt/320836.pdf). To avoid this situation, disable all "Cn(ACPI Cn) report to OS" BIOS options before sampling with VTune Amplifier on such systems.
Using result path `/tmp'
Executing actions 33 % Resolving information for `libpthread-2.15.so'
Warning: Cannot locate symbols for file `/usr/lib64/libpthread-2.15.so'.
Executing actions 34 % Resolving information for `libc-2.15.so'
Warning: Cannot locate symbols for file `/usr/lib64/libc-2.15.so'.
Executing actions 34 % Resolving information for `libxcb.so.1.1.0'
Warning: Cannot locate symbols for file `/usr/lib64/libxcb.so.1.1.0'.
Executing actions 35 % Resolving information for `libgthread-2.0.so.0.3200.1'
Warning: Cannot locate symbols for file `/usr/lib64/libgthread-2.0.so.0.3200.1'.
Executing actions 35 % Resolving information for `firefox'
Warning: Cannot locate symbols for file `/usr/lib64/firefox/firefox'.
Executing actions 35 % Resolving information for `libX11.so.6.3.0'
Warning: Cannot locate symbols for file `/usr/lib64/libX11.so.6.3.0'.
Executing actions 36 % Resolving information for `ld-2.15.so'
Warning: Cannot locate symbols for file `/usr/lib64/ld-2.15.so'.
Executing actions 36 % Resolving information for `libmozalloc.so'
Warning: Cannot locate symbols for file `/usr/lib64/xulrunner-2/libmozalloc.so'.
Executing actions 36 % Resolving information for `libxul.so'
Warning: Cannot locate symbols for file `/usr/lib64/xulrunner-2/libxul.so'.
Executing actions 37 % Resolving information for `libgobject-2.0.so.0.3200.1'
Warning: Cannot locate symbols for file `/usr/lib64/libgobject-2.0.so.0.3200.1'.
Executing actions 37 % Resolving information for `libnspr4.so'
Warning: Cannot locate symbols for file `/usr/lib64/libnspr4.so'.
Executing actions 50 % Generating a report
Summary
-------

Elapsed Time: 0.171
Executing actions 100 % done
### notice the elapsed time.... Collection ceased almost immediately.
### go to the tmp directory and look at results
[root@perflinux rlane6]# cd /tmp
[root@perflinux tmp]# ls -ltr
total 1508
drwxrwxrwt. 2 gdm gdm 4096 Oct 29 09:58 at-spi2
drwx------. 4 root colord 4096 Oct 29 09:58 systemd-namespace-E86Num
drwx------. 2 rlane6 rlane6 4096 Oct 29 09:58 pulse-fh1542wsgOPb
drwxr-xr-x. 2 rlane6 rlane6 4096 Oct 29 09:58 tracker-rlane6
drwx------. 4 root colord 4096 Oct 29 09:58 systemd-namespace-aHByZm
drwx------. 2 gdm gdm 4096 Oct 29 09:59 pulse-gEGHlqV72yaY
-rw-r--r--. 1 root root 47160 Oct 29 10:11 fileJpPjLb
-rw-------. 1 root root 224686 Oct 29 10:21 intel.pset.root.appleperflinux.apple.com_10.29.10.11.46.2012.log
-rw-------. 1 root root 43375 Oct 29 10:21 intel.issa.root.appleperflinux.apple.com_10.29.10.11.46.2012.log
drwx------. 2 rlane6 rlane6 4096 Oct 29 10:21 mozilla-media-cache
-rw-rw-r--. 1 rlane6 rlane6 1124 Oct 29 10:28 intel.ism.rlane6.appleperflinux.apple.com_10.29.10.28.06.2012.log
-rw-rw-r--. 1 rlane6 rlane6 4231 Oct 29 10:28 intel.ism.rlane6.appleperflinux.apple.com_10.29.10.28.06.2012.log.1
-rw-r--r--. 1 root root 1115 Oct 29 10:58 intel.ism.root.appleperflinux.apple.com_10.29.10.58.29.2012.log
-rw-r--r--. 1 root root 6927 Oct 29 10:58 intel.ism.root.appleperflinux.apple.com_10.29.10.58.29.2012.log.1
-rw-r--r--. 1 root root 1232 Oct 29 10:58 issa.log.prev
-rw-r--r--. 1 root root 1115 Oct 29 11:27 intel.ism.root.appleperflinux.apple.com_10.29.11.27.43.2012.log
-rw-r--r--. 1 root root 9241 Oct 29 11:27 intel.ism.root.appleperflinux.apple.com_10.29.11.27.43.2012.log.1
-rw-r--r--. 1 root root 1232 Oct 29 11:27 issa.log
-rw-------. 1 root root 418213 Oct 29 19:25 wUwHlyY8.pdf.part
-rw-r--r--. 1 root root 47749 Oct 29 19:33 filecPPWOn
-rw-------. 1 root root 141186 Oct 29 19:34 intel.pset.root.appleperflinux.apple.com_10.29.19.33.44.2012.log
-rw-------. 1 root root 954 Oct 29 19:34 intel.issa.root.appleperflinux.apple.com_10.29.19.33.44.2012.log
-rw-r--r--. 1 root root 47160 Oct 29 19:37 fileUZQvuX
drwxr-xr-x. 2 root root 4096 Oct 29 19:56 hsperfdata_root
-rw-------. 1 root root 360795 Oct 29 19:56 intel.pset.root.appleperflinux.apple.com_10.29.19.37.07.2012.log
-rw-------. 1 root root 26492 Oct 29 19:56 intel.issa.root.appleperflinux.apple.com_10.29.19.37.07.2012.log
-rw-rw-r--. 1 rlane6 rlane6 1124 Oct 29 19:56 intel.ism.rlane6.appleperflinux.apple.com_10.29.19.56.32.2012.log
-rw-rw-r--. 1 rlane6 rlane6 4402 Oct 29 19:56 intel.ism.rlane6.appleperflinux.apple.com_10.29.19.56.32.2012.log.1
-rw-rw-rw-. 1 root root 4852 Oct 29 20:06 intelremotemonagent.0.log
-rw-rw-r--. 1 rlane6 rlane6 2162 Oct 29 20:32 intelremotemonagent.1000.log
prw-------. 1 rlane6 rlane6 0 Oct 29 20:32 intelremotemonfifo.1000
-rw-rw-r--. 1 rlane6 rlane6 4331 Oct 29 20:32 intel.ism.rlane6.appleperflinux.apple.com_10.29.20.32.55.2012.log.1
-rw-rw-r--. 1 rlane6 rlane6 2347 Oct 29 20:33 intel.ism.rlane6.appleperflinux.apple.com_10.29.20.32.55.2012.log
drwxr-xr-x. 2 rlane6 rlane6 4096 Oct 29 20:33 hsperfdata_rlane6
drwxrwxr-x. 9 rlane6 rlane6 4096 Oct 29 20:33 amplxe-tmp-rlane6
drwxrwxr-x. 33 rlane6 rlane6 4096 Oct 30 10:20 amplxe-log-rlane6
drwxr-xr-x. 26 root root 4096 Oct 30 10:22 amplxe-log-root
drwxr-xr-x. 3 root root 4096 Oct 30 10:22 archive
-rw-r--r--. 1 root root 207 Oct 30 10:22 tmp.amplxe
drwxr-xr-x. 2 root root 4096 Oct 30 10:22 data.0
drwxr-xr-x. 2 root root 4096 Oct 30 10:22 sqlite-db
drwxr-xr-x. 2 root root 4096 Oct 30 10:22 config
drwxrwxrwx. 2 root root 4096 Oct 30 10:22 FLEXnet
drwxr-xr-x. 9 root root 4096 Oct 30 10:22 amplxe-tmp-root
### amplxe-cl expected results in a particular directory.... again wondering if the commands you want run were actually used.
[root@perflinux tmp]# amplxe-cl -report hotspots -filter module=firefox
Error: Result path `/tmp/r@@@{at}' does not exist.
### look at size of filesystem.... it's plenty big.
[root@perflinux tmp]# df -k .
Filesystem 1K-blocks Used Available Use% Mounted on
/dev/mapper/vg_appleperflinux-lv_root 52327276 6193480 43512356 13% /
### modified instructions to put the VTunes files in an expected directory
[root@perflinux rlane6]# amplxe-cl -collect lightweight-hotspots -duration 60 -r /tmp/r000hs -- firefox
Warning: On some systems based on the Intel microarchitecture code name Nehalem / Westmere with C-states enabled, this analysis type may cause system hanging due to a known hardware issue (see errata AAJ134 in http://download.intel.com/design/processor/specupdt/320836.pdf). To avoid this situation, disable all "Cn(ACPI Cn) report to OS" BIOS options before sampling with VTune Amplifier on such systems.
Using result path `/tmp/r000hs'
Executing actions 33 % Resolving information for `libX11.so.6.3.0'
Warning: Cannot locate symbols for file `/usr/lib64/libX11.so.6.3.0'.
Executing actions 34 % Resolving information for `libpthread-2.15.so'
Warning: Cannot locate symbols for file `/usr/lib64/libpthread-2.15.so'.
Executing actions 34 % Resolving information for `libxul.so'
Warning: Cannot locate symbols for file `/usr/lib64/xulrunner-2/libxul.so'.
Executing actions 35 % Resolving information for `libstdc++.so.6.0.17'
Warning: Cannot locate symbols for file `/usr/lib64/libstdc++.so.6.0.17'.
Executing actions 35 % Resolving information for `libc-2.15.so'
Warning: Cannot locate symbols for file `/usr/lib64/libc-2.15.so'.
Executing actions 36 % Resolving information for `ld-2.15.so'
Warning: Cannot locate symbols for file `/usr/lib64/ld-2.15.so'.
Executing actions 37 % Resolving information for `libxcb.so.1.1.0'
Warning: Cannot locate symbols for file `/usr/lib64/libxcb.so.1.1.0'.
Executing actions 50 % Generating a report
Summary
-------

Elapsed Time: 0.070
Executing actions 100 % done
### once again the program almost immediately closed based on the elapsed time
### check /tmp to verify that directory r000hs exists
[root@perflinux rlane6]# cd /tmp
[root@perflinux tmp]# ls
amplxe-log-rlane6 intel.ism.rlane6.appleperflinux.apple.com_10.29.10.28.06.2012.log.1 intelremotemonagent.0.log
amplxe-log-root intel.ism.rlane6.appleperflinux.apple.com_10.29.19.56.32.2012.log intelremotemonagent.1000.log
amplxe-tmp-rlane6 intel.ism.rlane6.appleperflinux.apple.com_10.29.19.56.32.2012.log.1 intelremotemonfifo.1000
amplxe-tmp-root intel.ism.rlane6.appleperflinux.apple.com_10.29.20.32.55.2012.log issa.log
archive intel.ism.rlane6.appleperflinux.apple.com_10.29.20.32.55.2012.log.1 issa.log.prev
at-spi2 intel.ism.root.appleperflinux.apple.com_10.29.10.58.29.2012.log mozilla-media-cache
config intel.ism.root.appleperflinux.apple.com_10.29.10.58.29.2012.log.1 pulse-fh1542wsgOPb
data.0 intel.ism.root.appleperflinux.apple.com_10.29.11.27.43.2012.log pulse-gEGHlqV72yaY
filecPPWOn intel.ism.root.appleperflinux.apple.com_10.29.11.27.43.2012.log.1 r000hs
fileJpPjLb intel.issa.root.appleperflinux.apple.com_10.29.10.11.46.2012.log sqlite-db
fileUZQvuX intel.issa.root.appleperflinux.apple.com_10.29.19.33.44.2012.log systemd-namespace-aHByZm
FLEXnet intel.issa.root.appleperflinux.apple.com_10.29.19.37.07.2012.log systemd-namespace-E86Num
hsperfdata_rlane6 intel.pset.root.appleperflinux.apple.com_10.29.10.11.46.2012.log tmp.amplxe
hsperfdata_root intel.pset.root.appleperflinux.apple.com_10.29.19.33.44.2012.log tracker-rlane6
intel.ism.rlane6.appleperflinux.apple.com_10.29.10.28.06.2012.log intel.pset.root.appleperflinux.apple.com_10.29.19.37.07.2012.log wUwHlyY8.pdf.part
[root@perflinux tmp]# amplxe-cl -report hotspots -filter module=firefox
Using result path `/tmp/r000hs'
Executing actions 50 % Generating a report
Function Module CPU Time
-------- ------ --------
Executing actions 100 % done
### NOTHING
### firefox was running
[root@perflinux tmp]# ps -aux | grep firefox
Warning: bad syntax, perhaps a bogus '-'? See /usr/share/doc/procps-3.2.8/FAQ
rlane6 3830 0.2 5.1 1076272 208724 ? Sl Oct29 4:14 /usr/lib64/firefox/firefox
root 6089 0.4 5.9 1046612 241832 pts/0 Sl Oct29 4:28 /usr/lib64/firefox/firefox file /opt/intel/vtune_amplifier_xe_2013/documentation/en/help/index.htm#GUID-8997AED9-A7B7-4F95-8298-9B75E256E04C.htm
root 6105 0.0 0.0 0 0 pts/0 Z Oct29 0:00 [firefox]
root 6747 0.0 0.0 109404 884 pts/0 S+ 10:35 0:00 grep --color=auto firefox

Imagen de Peter Wang (Intel)

That was so strange - you met
### notice the elapsed time.... Collection ceased almost immediately.

Did you install OS in Virtual Machine? If this was the case, PMU resource lightweight-hotspots depends on will be invisible in your OS, You may try hotspots instead, such as
amplxe-cl -collect hotspots -duration 60 -r /tmp/r000hs -- firefox

If it was not the case, you still can use
amplxe-cl -collect lightweight-hotspots -duration 60 -r /tmp/r001lh -- firefox
Please go https://premier.intel.com to submit a ticket for investigating, with result directory i.e. r001lh.zip, also use
amplxe-feedback -create-bug-report ,
and send log files. Thanks.

Does the update-2 support linux 3.6 ?
I was trying to use Update-2 on linux kernel 3.6 and fedora 17 and it didnt work at all ?
Not even running hotspot analysis for tachyon worked.
Now I am getting the above error for vtsspp.ko .

I am now able to run hotspot analysis but no Sandy bridge memory access analysis at all.
Please help.

Imagen de Peter Wang (Intel)

Please work on Linux kernel 3.3

I could not make it work with Linux kernel 3.3. The assistance from Intel to resolve the issues proved of no benefit. As much as I would like to use Vtune, getting it to run under Lunix is a sucking black hole. I have better things to do with my time than debugging a poor implementation of Vtune that is poorly or incorrectly documented. It is much easier to run a version for Windows. I have experience in a previous life running Vtune under Linux and it worked flawlessly. This particular version just seems to lack robustness, appropriate documentation, and support. The earlier versions for Windows and Linux that I used never required support. That says something about this release compared with earlier ones.

Imagen de Peter Wang (Intel)

Based on your post 10/26/2012 -
[ My alternatives are 1) download Fedora sources for 3.6 and compile the drivers, 2) find Fedora 17 version 3.3 and download that ...]
Even you built/installed drivers successfully but source version v3.6 was used- can you use v3.3 to build drivers?
If it still doesn't work, can you do:
1. export AMPLXE_DEBUG=y
(ensure nmi watch dog is disabled)
2. amplxe-cl -collect lightweight-hotspots -duration 60 -r /tmp/r000lh -- firefox

Please attach zipped r000lh directory for investigating. Thank you.

Imagen de Kacper Kowalik

Hi,
I've been hit by this issue. Short googling showed that Arch Linux guys have short doc how to deal with this:
https://wiki.archlinux.org/index.php/VTune#kmap_atomic_and_kunmap_atomic...

I've applied their patch and I'm successfully using VTune 2013 on
Linux sandbox 3.6.9-2.fc17.x86_64 #1 SMP Tue Dec 4 13:26:04 UTC 2012 x86_64 x86_64 x86_64 GNU/Linux
Best regards,
Kacper Kowalik

Imagen de Peter Wang (Intel)

Thank you. It seems to disable KM_NMI / enable KM_IRQ0 in VTSSP code in v3.6 kernel, there is no same issue in v3.3 kernel?

By the way, disable NMI Watchdog timer before doing Event-based sampling:

[root@snb01 ~]# cat /proc/sys/kernel/nmi_watchdog 1

[root@snb01 ~]# echo 0 > /proc/sys/kernel/nmi_watchdog

[root@snb01 ~]# cat /proc/sys/kernel/nmi_watchdog

0

I suppose that this kernel version hasn't been tested (supported)      yet too    :)

http://www.driversdownloader.com

Inicie sesión para dejar un comentario.