124 résultats de recherche pour "recursive"

  1. Tips and Tricks for Deeper Recursive Routines


    Oct 29, 2015 ... RECURSIVE SUBROUTINE recur_3d(sp,ep,t1,t2,t5,t6,t7,t10,t11) ... 05, RECURSIVE SUBROUTINE recur_3d_all(sp,ep,t1x,t2x,t5x,t6x,t7x,t10x ...

  2. Problem with -recursive -assume realloc_lhs -standard-semantics


    Aug 6, 2015 ... I see different results for the attached code depending on the used compiler flags. Notice that the code uses a recursive elemental subroutine, ...

  3. Valgrind confused by a recursive internal subroutine.


    I found that Valgrind can get confused by an internal, recursive subroutine compiled with Intel Fortran. Apparently, these routines can have a separate stack,  ...

  4. Using a lock with recursive mutex for condition variable


    Hi, I was wondering if there was any reason why the condition_variable won't accept a unique lock with a recursive mutex. Compiler gives an error when I try to  ...

  5. Problem with recursive subroutine with class(*) argument


    21 mai 2014 ... ... a segmentation fault - I think that the code is fine. Seems to me like a problem related to the RECURSIVE subroutine with a CLASS(*) argument.

  6. Calling MKL cblas_dgemm in recursive function


    20 oct. 2013 ... I am trying to implement a recursive matrix multiplication on Xeon Phi. I have two implementation . The first one I have my own implementation ...

  7. runtime I/O error in recursive function.


    5 avr. 2010 ... I have a piece of Fortran 90 code which uses a recursive function for testing purpose.I use both ifort (v 11.1) and gfortran (v 4.3.2) on an AMD64 ...

  8. Recursive subroutine with multiple calls


    Dec 29, 2007 ... Hello, I have a recursive subroutine which is called from a 'main' program, and which within its own source code calls itself on four separate ...

  9. Recursive function causes compile-time error


    27 févr. 2003 ... Hi, I have a simple recursive function that causes compilation with ifc to fail. It's as if recursion is not being allowed. The errors reported are: ...

  10. Recursive Gaussian blur fail on Intel HD 4000 with lastest driver ...


    ... 4000 with lastest driver version. freedayman. jeu, 13/06/2013 - 08:05. Hi Intel Tech support and all. I download the opencl recursive blur sample from Nvidia at  ...

  11. recursive I/O operation error


    19 juil. 2002 ... ... with the main program thread(in WM_PAINT).I get run time error 40 on execution.Runtime error 40 as you know is for:Recursive I/O operation.

  12. Missing: a sparse ?ger (rank1 update)?? (Recursive least squares)


    9 août 2006 ... Recursive least squares works by updating the inverse of the cross-product matrix: B:=(A'*A + lambda*I)^(-1) using rank-1 updates of the form ...

  13. Can binary/symbol and sources search paths use top-level and go ...


    6 nov. 2015 ... When setting up the Binary/Symbol search and sources searches, can I use a top -level dir and expect the tool to go recursive? There are a ...

  14. recursion


    Another question about recursion:I have a recursive subroutine which may have large recursion-depths, I increased the stack to 10MB for this.1) is it possible to ...

  15. pointer and stack local storage


    RECURSIVE should have made the pointer a stack variable. ... Luckily, I saw this thread and recalled that something is fishy in Qsave/recursive field. Then ...

  16. Français


    Fortran compilers nowadays are good at the recursive scalar replacement option ... the loop recursive version with scalar temporaries and Intel directive is faster.

  17. How to make DLL routines thread safe?


    Check out the /recursive and /automatic command line options and save your fingers some typing. ... Arjen has the right idea - use the RECURSIVE keyword.

  18. CVF 6.6 DLL being called by Delphi ISAPI App Problem


    RECURSIVE SUBROUTINE foo() INTEGER:: i = 0 !i is now SAVEd ... Jugoslav has the correct solution - declare all the routines RECURSIVE or use the compiler ...

  19. undefined reference to `_intel_fast_memcpy'


    Sep 5, 2009 ... make[2]: Leaving directory `/home/alex/Desktop/FEA/mbdyn/src/mbdyn-1.3.7/ libraries/libmbwrap' make[1]: *** [all-recursive] Error 1 make[1]: ...

  20. Netcdf-4.3.0 Installation Compiler Error


    3 déc. 2013 ... make[2]: *** [libnetcdf4_la-nc4var.lo] Error 1 make[2]: Leaving directory `/app/ setups/netcdf-4.3.0/libsrc4' make[1]: *** [all-recursive] Error 1

Pour de plus amples informations sur les optimisations de compilation, consultez notre Avertissement concernant les optimisations.